Unnamed: 0,Unnamed: 1,Unnamed: 2,Unnamed: 3,Unnamed: 4,Unnamed: 5,Unnamed: 6,Unnamed: 7,Unnamed: 8,Unnamed: 9,Unnamed: 10,Unnamed: 11,Unnamed: 12,Unnamed: 13,Unnamed: 14,Unnamed: 15,Unnamed: 16,Unnamed: 17,Unnamed: 18,Unnamed: 19,Unnamed: 20,Unnamed: 21,Unnamed: 22,Unnamed: 23,Unnamed: 24,Unnamed: 25,Unnamed: 26,Unnamed: 27,Unnamed: 28,Unnamed: 29,Unnamed: 30
,,,HERV-W ENV,,,,IgG SARS-CoV-2,,,,,,IgM SARS-CoV-2,,,,,,IgA SARS-CoV-2,,,,,,IgE SARS-CoV-2,,,,,
Status,Sample number,Pre pandemic (before 2019) ,Mean normalized AUC 440kDa,S / N ,LOD S/N ≥1,Positivity HERV-W ENV ,Mean total AUC (N+S+S1+S2+RBD ),Detection result,Mean AUC Nucleocapsid,Detection result,Mean AUC Spike,Detection result,Mean total AUC (N+S+S1+S2+RBD ),Detection result,Mean AUC Nucleocapsid,Detection result,Mean AUC Spike,Detection result,Mean total AUC (N+S+S1+S2+RBD ),Detection result,Mean AUC Nucleocapsid,Detection result,Mean AUC Spike,Detection result,Mean total AUC (N+S+S1+S2+RBD ),Detection result,Mean AUC Nucleocapsid,Detection result,Mean AUC Spike,Detection result
ppHBD,1,Yes,1505886.33626183,0.8251618895018865,1,negative,18380.699999999997,negative,8119.75,negative,1872.6,negative,1106580.6,,256652.44999999998,,462554.65,,1018518.4500000001,negative,273409.9,negative,327705.5,negative,8361.75,negative,1822.1,negative,448.5,negative
ppHBD,2,Yes,1066729.726534548,0.5845225868519559,1,negative,160815.55000000002,negative,133932.95,negative,1195.55,negative,231616,negative,7825.45,negative,1528.3000000000002,negative,895723.5,negative,687467,negative,38442.7,negative,12213.100000000002,negative,1586.6999999999998,negative,135.9,negative
ppHBD,3,Yes,1302744.7545140653,0.7138488148094596,1,negative,45172.05,negative,42532.6,negative,935.05,negative,63744.50000000001,negative,39713.350000000006,negative,1317.15,negative,93134.79999999999,negative,2094.8,negative,82.65,negative,11785.349999999999,negative,1592.3000000000002,negative,28,negative
ppHBD,4,Yes,2033651.251841925,1.0337394739798966,1,negative,117900.85,negative,6336.25,negative,89444.05,negative,85985,negative,65204.05,negative,265.8,negative,761351.6,negative,280147.15,negative,318957.1,negative,14060,negative,3179.8,negative,52.5,negative
pHBD,5,No,,,,,2945498.55,positive,745.85,negative,1039559.2000000001,positive,146144.3,negative,37993.6,negative,6688.55,negative,2850012.55,negative,3894.8,negative,783723.45,negative,46784.7,positive,1009.85,negative,13042.8,positive
pHBD,6,No,,,,,1746809.65,positive,928.25,negative,366319.80000000005,positive,328034.1,negative,36852.4,negative,429.75,negative,1287252.9,negative,1345.15,negative,338374.65,negative,19266.35,positive,1300.65,negative,3926.1,positive
pHBD,7,No,,,,,3929051.2000000007,positive,3204.05,negative,872538.55,positive,924607.3,positive,414806.95,negative,1118.4,negative,2962440.45,negative,73448.6,negative,853473.4,negative,25417.6,positive,3587.1,negative,3794.3,positive
pHBD,8,No,,,,,5221158.9,positive,58545.1,negative,1882788.5,positive,126782.95,negative,25061.95,negative,23121.95,negative,6255982.15,positive,131873.45,negative,1766067.2,positive,112171.45000000001,positive,1656.15,negative,34749.15,positive
pHBD,9,No,,,,,2222105.0999999996,positive,3471.55,negative,495970.35,positive,94463.55,negative,9486.2,negative,17089.1,negative,2189906.35,negative,9224.9,negative,572036.75,negative,29981.800000000003,positive,2352.6,negative,6523.05,positive
pHBD,10,No,,,,,2690672.9000000004,positive,952752.45,positive,411997.05,positive,78587.9,negative,25583.6,negative,6033.95,negative,3047217.45,negative,765928.7,negative,359185.7,negative,18722.15,negative,5220.9,negative,1307.45,negative
pHBD,11,No,,,,,1459367.7999999998,positive,823.0999999999999,negative,4085.6499999999996,positive,12502.9,negative,1642.45,negative,41.05,negative,65846.29999999999,negative,738.6,negative,2101.25,negative,9623.75,negative,1027.75,negative,273.85,negative
pHBD,12,No,,,,,4718907.299999999,positive,2295703.8,positive,462181.05,positive,58433.95,negative,5860.85,negative,4076.3,negative,2470435.5,negative,1533313.35,negative,72193.1,negative,33109.15,positive,11880.1,positive,3987.95,positive
pHBD,13,No,,,,,1675038.0999999999,positive,7366.2,negative,109404,negative,97569.54999999999,negative,37679.05,negative,662.75,negative,665920.6499999999,negative,31796.25,negative,133038.95,negative,13136.849999999999,negative,1340.2,negative,112.15,negative
pHBD,14,No,,,,,6341065.6,positive,88477.75,negative,1531405,positive,133758.35,negative,8831.75,negative,6398.9,negative,5210208.850000001,positive,189372.85,negative,1478369.95,positive,80028.05,positive,1820.05,negative,22347.95,positive
pHBD,15,No,,,,,5741707.95,positive,4081.4,negative,1729751.7,positive,545288.2,negative,179175.1,negative,1195.1,negative,5098422.649999999,positive,167716.2,negative,305111.55,negative,73979.45,positive,2038.35,negative,16659.85,positive
CFS,16,Yes,5007384.421646715,2.17582397887543,2.17582397887543,positive,29268,negative,2108.25,negative,2595.05,negative,46113.55,negative,1762.1,negative,30621.25,negative,398356.6,negative,155606.7,negative,56925.95,negative,4674.5,negative,559.25,negative,181.8,negative
CFS,17,Yes,4453004.554620297,1.934933145156461,1.934933145156461,positive,36088,negative,13840.349999999999,negative,1748.4,negative,59805.25,negative,38726.9,negative,1793.3,negative,525775.55,negative,215545.65,negative,88490.45,negative,9375.95,negative,1439.4,negative,906.0500000000001,negative
CFS,18,Yes,812487.748602019,0.35304476830384357,1,negative,25018.300000000003,negative,1553.35,negative,10153.2,negative,45081.100000000006,negative,25603.1,negative,240.85,negative,294685.75,negative,3486.3,negative,29753.85,negative,11681.9,negative,1811.8,negative,582.7,negative
CFS,19,Yes,1385582.8201504364,0.6020677587862768,1,negative,27554.95,negative,14253.75,negative,79.1,negative,268061.15,negative,198103.55,negative,0,negative,564445.3,negative,397842.4,negative,34155.25,negative,10527.15,negative,1357.25,negative,339.84999999999997,negative
CFS,20,Yes,2007517.1689152617,0.8723124207754788,1,negative,228465.55000000002,negative,3039.25,negative,491.9,negative,16566.45,negative,3513.5,negative,180.1,negative,348931.19999999995,negative,181515.75,negative,10921.1,negative,11760.75,negative,1854.4499999999998,negative,895,negative
CFS,21,Yes,1409599.9936124699,0.6125036990098289,1,negative,687877.6,negative,436199.6,negative,58.15,negative,44216.3,negative,10977.35,negative,248.3,negative,3842599.65,negative,3684945.3499999996,negative,14469.55,negative,12918.349999999999,negative,2362.1499999999996,negative,406.6,negative
CFS,22,Yes,1972523.1865319805,0.857106720971882,1,negative,223725.94999999998,negative,3706.9500000000003,negative,4371,negative,283155.1,negative,260944.8,negative,1463.7,negative,293786.10000000003,negative,150605.45,negative,28321.25,negative,13968.8,negative,2603.45,negative,125.85,negative
CFS,23,Yes,1686226.2567214046,0.7327040737560641,1,negative,903482.1000000001,negative,269286.45,negative,44019.8,negative,86003.9,negative,12539.7,negative,6515,negative,2546807.9499999997,negative,1883746.7,negative,273768.75,negative,13099.15,negative,2458.05,negative,663.7,negative
CFS,24,Yes,1103777.6014228524,0.4796169891356917,1,negative,1132650.3,negative,4753.15,negative,392256.6,negative,160272.35,negative,25229.75,negative,1382.15,negative,4225428.550000001,negative,486201.25,negative,1764061.1,negative,13700.7,negative,2124.8999999999996,negative,707.7,negative
CFS,25,Yes,1048982.7542500133,0.45580729831046213,1,negative,66531.3,negative,210.14999999999998,negative,922,negative,59837.3,negative,5037.35,negative,587.35,negative,146079.1,negative,15474.65,negative,7969.65,negative,13165.150000000001,negative,1590.65,negative,1010.7,negative
CFS,26,Yes,1432681.3400965591,0.6225329256534483,1,negative,147921.55,negative,6369.9,negative,36419.8,negative,452700.64999999997,negative,126926,negative,67908.79999999999,negative,852895.1,negative,114418.9,negative,246539,negative,14733.400000000001,negative,2686.45,negative,403.29999999999995,negative
CFS,27,Yes,1471122.1200730398,0.6392364264292973,1,negative,41659.45,negative,39728.35,negative,0,negative,21240.45,negative,7620.299999999999,negative,377.65,negative,2646032.05,negative,2369185.95,negative,701.35,negative,13482.75,negative,2168.8500000000004,negative,1396.05,negative
CFS,28,Yes,1063195.6268383716,0.461983174498052,1,negative,114645.15000000002,negative,64096.85,negative,46375.15,negative,21679.45,negative,10249.900000000001,negative,2927.3,negative,868063.65,negative,719528.3999999999,negative,10938.2,negative,9090.800000000001,negative,1735.6999999999998,negative,26.5,negative
CFS,29,Yes,1476190.2439948919,0.6414385892744888,1,negative,4424.4,negative,534.4,negative,1012.6,negative,29363.9,negative,9721.05,negative,1284.65,negative,192237.2,negative,18018.4,negative,28171.1,negative,8240.4,negative,1727.35,negative,75.7,negative
CFS,30,Yes,2090234.0605567442,0.9082548643559243,1,negative,57492.899999999994,negative,15067.55,negative,2442.6000000000004,negative,56837.100000000006,negative,4857.1,negative,8699.2,negative,3192935.9000000004,negative,160276.7,negative,396888.35,negative,9560.1,negative,1714.5,negative,211.65,negative
CFS,31,Yes,2104169.7513638926,0.9143103776571452,1,negative,20275.25,negative,19267.75,negative,372,negative,205337.8,negative,35055.899999999994,negative,879.15,negative,335175.6,negative,68959.65,negative,0,negative,8824.3,negative,1817.85,negative,27.8,negative
CFS,32,Yes,1427875.971477897,0.6204450423718492,1,negative,34425.15,negative,26625.300000000003,negative,0,negative,924779,positive,600273.1,positive,32506.1,negative,1563888.1,negative,751760.7,negative,20491.699999999997,negative,10070.150000000001,negative,2276.8500000000004,negative,56.3,negative
Post-COVID-19 condition,33,No,1804230.9000000001,0.7839799669184185,1,negative,385158.35,negative,20043.5,negative,125073.25,negative,131689.55,negative,35760.149999999994,negative,49.55,negative,935072.3500000001,negative,41884.3,negative,250900.15000000002,negative,19448,positive,1040.0500000000002,negative,4864.85,positive
Post-COVID-19 condition,34,No,1235540.65,0.536871050495391,1,negative,14982673.05,positive,565332.4,positive,7802375.4,positive,493871.35,negative,28126.949999999997,negative,221611,negative,14920193.899999999,positive,4256130.85,positive,5667624.3,positive,207799.59999999998,positive,22072.35,positive,106774.2,positive
Post-COVID-19 condition,35,No,2091393.2,0.9087584765772299,1,negative,45051.85000000001,negative,2790.5,negative,2016.5,negative,682548.8,negative,622004.3999999999,negative,3578.9,negative,2390033.25,negative,976377.95,negative,759217.85,negative,15500.6,negative,4370.3,negative,2452.6,negative
Post-COVID-19 condition,36,No,3132381.3278171965,1.3610917630590997,1.3610917630590997,positive,2173615.4000000004,positive,4113.55,negative,1142382.75,positive,1203988.5,positive,1028865.1,positive,41210.9,negative,6402235,positive,497915.19999999995,negative,3106045.25,positive,70662.4,positive,6025.65,positive,34268,positive
Post-COVID-19 condition,37,No,3422747.29069473,1.487262484587681,1.487262484587681,positive,384446.89999999997,negative,140093.2,negative,107664.95000000001,negative,573.7,negative,410.4,negative,144,negative,1472753.8,negative,615678.2,negative,434666.2,negative,22162.3,positive,11925.099999999999,positive,0,negative
Post-COVID-19 condition,38,No,3426313.157122918,1.4888119938035358,1.4888119938035358,positive,10775652.45,positive,686629.3,positive,5706063.800000001,positive,84788.1,negative,83340.95,negative,100.3,negative,10258946,positive,1415528.25,negative,5097873.25,positive,124840.04999999999,positive,18305.449999999997,positive,57421.95,positive
Post-COVID-19 condition,39,No,2604653.4778790753,1.1317817800347958,1.1317817800347958,positive,6712895.449999999,positive,786076.6,positive,3425757.5,positive,68870.05,negative,38321.65,negative,362.9,negative,9793088.600000001,positive,2026001.3,negative,3809467.8499999996,positive,48478.3,positive,8077.85,positive,21156.25,positive
Post-COVID-19 condition,40,No,2239653.294609125,0.9731808647832438,1,negative,105910.35,negative,27447.050000000003,negative,31962.6,negative,113271.9,negative,98408.7,negative,179.39999999999998,negative,977228.6000000001,negative,176337.55,negative,290135.4,negative,13193.5,negative,4399.85,negative,53.199999999999996,negative
Post-COVID-19 condition,41,No,3574808.7543277293,1.5533369294506438,1.5533369294506438,positive,2082149.4500000002,positive,1696.15,negative,1060988.25,positive,3553877.55,positive,3272652.15,positive,98656.3,negative,2465526.2,negative,1120734.25,negative,646278.4,negative,21534.25,positive,5540.1,positive,4806.4,positive
Post-COVID-19 condition,42,No,5058736.492687287,2.1981374236054103,2.1981374236054103,positive,239389.45,negative,7116.049999999999,negative,116565.2,negative,130517.2,negative,58424.45,negative,5229.75,negative,987216.55,negative,68592.7,negative,340676.19999999995,negative,17597.7,negative,4029.4,negative,31.45,negative
Post-COVID-19 condition,43,No,2808889.271901601,1.2205270307945655,1.2205270307945655,positive,844488.55,negative,9666.8,negative,512978.75,negative,339170.70000000007,negative,271487.35,negative,30828.25,negative,2268205.75,negative,501556.8,negative,1002764.45,negative,23497,positive,3790.15,positive,6858,positive
Post-COVID-19 condition,44,No,1707912.9190705477,0.7421275752603391,1,negative,10983871.55,positive,776894.5,positive,3768601.6,positive,259919.65000000002,negative,37296.5,negative,39010.9,negative,9112111.05,positive,2191516.7,negative,3591684.05,positive,70197.1,positive,8275.75,positive,30756.8,positive
Acute COVID-19,45,No,2773230.24,1.2050324774446055,1.21,positive,30664497.55,positive,6348589.15,positive,5300688.800000001,positive,17006782.85,positive,4506080.2,positive,1437903.45,positive,56014441.699999996,positive,8867796.15,positive,8443981,positive,26022.8,positive,4732.35,positive,2581.8,positive
Acute COVID-19,46,No,2405434.77,1.0452168660271404,1.05,positive,12598223.9,positive,12353884.2,positive,86059.4,negative,19441259.9,positive,4153722.65,positive,415786.35,positive,26787646.35,positive,8436753.55,positive,930626.5,negative,69172.2,positive,28061.65,positive,1296.25,negative
Acute COVID-19,47,No,1436553.64,0.6242156770190367,1,negative,488837.94999999995,negative,207021.45,negative,134364.9,negative,1519384.0500000003,positive,745481.3,positive,0,negative,2972219.7,negative,1204340.15,negative,80148.05,negative,6317.45,negative,1728.8,negative,25.75,negative
Acute COVID-19,48,No,2337000.72,1.015480693522016,1.02,positive,13627376.6,positive,3857241.95,positive,5899690.5,positive,13843452.5,positive,6602519.3,positive,107713.3,positive,19165007.6,positive,5963169.85,positive,1830723.95,positive,201734.44999999998,positive,80845.45,positive,10367.9,positive
Acute COVID-19,49,No,1343837.9100000001,0.5839285547280347,1,negative,820881.15,negative,29829.75,negative,393651.45,negative,1068303.8,positive,487037.25,negative,7584.65,negative,13533858.55,positive,1899952.8,negative,1958525.2,positive,5763.6,negative,1698.2,negative,208.25,negative
Acute COVID-19,50,No,2346365.8200000003,1.0195500453889264,1.02,positive,1302042.75,positive,1181399.4,positive,46340.45,negative,3868153.7,positive,1388295.55,positive,128841.9,positive,17533131.6,positive,7834854.15,positive,176282.2,negative,55851.1,positive,21238.1,positive,3143.4,positive
Acute COVID-19,51,No,1547327.8,0.6723496034908775,1,negative,7774776.25,positive,7260824.15,positive,248058.3,negative,2092584.5000000002,positive,959904.9,positive,21959.6,negative,23941561.150000002,positive,11164310.85,positive,282867.6,negative,177458.39999999997,positive,87388.2,positive,543.7,negative
Acute COVID-19,52,No,889415.42,0.3864715058927218,1,negative,191406.59999999998,negative,6428.950000000001,negative,148067.2,negative,14520.2,negative,3935.4,negative,99.3,negative,404354.75,negative,17938.45,negative,37147.6,negative,1398.3000000000002,negative,493.1,negative,12.85,negative
Acute COVID-19,53,No,4143367.583333333,1.8003887423021299,1.8,positive,11701405.8,positive,11465166.25,positive,66912.9,negative,5550001.65,positive,1998764,positive,290931.35,positive,15412731.400000002,positive,5532849.15,positive,1194480.95,negative,29150.05,positive,8988.95,positive,2542.45,positive
Acute COVID-19,54,No,2288658.6666666665,0.9944749567992597,1,negative,75884.6,negative,31997.9,negative,13645.05,negative,952896.2,positive,18088.7,negative,216687.95,positive,1514976.9999999998,negative,120005.85,negative,123533.95,negative,5347,negative,1303,negative,0,negative
Acute COVID-19,55,No,1960083.6666666665,0.8517015438437017,1,negative,11670026.100000001,positive,11160771.05,positive,84142.7,negative,2207927.95,positive,358589.1,negative,262980.4,positive,24871334.300000004,positive,9789479.4,positive,904599.6,negative,11863.949999999999,negative,5583.4,negative,1499.85,negative
Acute COVID-19,56,No,2401279.8333333335,1.0434114502513991,1.04,positive,898735.8,negative,4864.6,negative,465759.05000000005,negative,350900.05,negative,97209.9,negative,33340.85,negative,4425736.5,negative,1827466,negative,1124070.4,negative,28838.3,positive,962.65,negative,2452.05,positive
Acute COVID-19,57,No,878198.75,0.38159760417196936,1,negative,9229.25,negative,4325.05,negative,1427.3,negative,16308.4,negative,2329.65,negative,61.25,negative,79400.85,negative,13466,negative,4331.3,negative,12110.85,negative,987.9,negative,463.75,negative
Acute COVID-19,58,No,3361547.5833333335,1.4606699270638608,1.46,positive,1813091.2,negative,910069.8,negative,226223.90000000002,negative,1074927.8000000003,positive,502067.65,positive,12819.05,negative,4542007.7,negative,1531474.65,negative,231431.45,negative,89493.25,positive,27365.75,positive,1925.75,positive
Acute COVID-19,59,No,3121007.5,1.3561497150875559,1.36,positive,2418577.5,positive,372641.3,negative,1150137.75,positive,6769188.899999999,positive,3278096.45,positive,49943.9,negative,8330202.9,positive,1586910,negative,1434391,positive,64977.6,positive,4127.6,positive,12632.25,positive
Acute COVID-19,60,No,1877220.5833333335,0.815695623686901,1,negative,33768035.1,positive,9987763.15,positive,12107754.350000001,positive,6084061.8,positive,2457053.75,positive,114614.2,positive,32436298.05,positive,3340033.25,negative,4934019.55,positive,54065.65000000001,positive,8581.95,positive,5608.95,positive
Acute COVID-19,61,No,4214038.9399999995,1.8310970761361083,1.83,positive,6763067.55,positive,337862.75,negative,3705125.75,positive,8426362.2,positive,25567,negative,2270505.8,positive,20686351.2,positive,5612568.75,positive,2640592.9,positive,67919.4,positive,2521.85,negative,5858.95,positive
Acute COVID-19,62,No,1745591.6066666665,0.7584997985555076,1,negative,393609.80000000005,negative,369179.35,negative,4661.950000000001,negative,359227.4,negative,76347.7,negative,26117.95,negative,3992565.8,negative,1687375.05,negative,96357.4,negative,16407.45,negative,3624.25,negative,0,negative
Acute COVID-19,63,No,1434486.0333333332,0.6233172542526982,1,negative,46060.55,negative,18557.25,negative,3437.9500000000003,negative,18510.949999999997,negative,2428.75,negative,79.75,negative,379264.15,negative,38848.65,negative,38311,negative,10884.95,negative,1390.95,negative,93.65,negative
Acute COVID-19,64,No,1012031.0133333332,0.439750808157869,1,negative,3097375.75,positive,642062.7,positive,1380050.55,positive,132935.9,negative,47020.25,negative,7279.9,negative,37603491.55,positive,10162819,positive,5333463.7,positive,37700.4,positive,18266.35,positive,54.15,negative
Acute COVID-19,65,No,1632165.2199999997,0.7092134184486316,1,negative,7050452.1,positive,3966598.5999999996,positive,1987920.6,positive,6281544.8,positive,729799.6,positive,1468550.1,positive,50497650.95,positive,11158178.65,positive,9627306.95,positive,254687.6,positive,4024.1,positive,57955.05,positive
Acute COVID-19,66,No,1356788.7399999998,0.5895559889506845,1,negative,215592.3,negative,166025.2,negative,22118.7,negative,124951.2,negative,34503.8,negative,8237.85,negative,14713971.35,positive,7229049.9,positive,12950.5,negative,12095.85,negative,2186.1,negative,89.45,negative
,,,,,,,,,,,,,,,,,,,,,,,,,,,,,,
,,,,,,,,,,,,,,,,,,,,,,,,,,,,,,
,,,,,,,,Mean HBD + 3SD Pre pandemic CTRL,1134705.663508533,cut-off AUC Raw data IgG ,,,,Mean HBD + 3SD Pre pandemic CTRL,800464.9236853046,cut-off AUC Raw data IgM ,,,,Mean HBD + 3SD Pre pandemic CTRL,5052574.260077868,cut-off AUC Raw data IgA ,,,,Mean HBD + 3SD Pre pandemic CTRL,18913.6620683748,cut-off AUC Raw data IgE ,,
,,,,,,,,,,,,,,,,,,,,,,,,,,,,,,
,,,,,,,,Mean HBD + 3SD Pre pandemic CTRL,375542.22916074086,cut-off AUC Nucleocapsid IgG,,,,Mean HBD + 3SD Pre pandemic CTRL,500595.35696315556,cut-off AUC Nucleocapsid IgM,,,,Mean HBD + 3SD Pre pandemic CTRL,3401577.5979562984,cut-off AUC Nucleocapsid IgA,,,,Mean HBD + 3SD Pre pandemic CTRL,3648.9825186473727,cut-off AUC Nucleocapsid IgE,,
,,,,,,,,,,,,,,,,,,,,,,,,,,,,,,
,,,,,,,,Mean HBD + 3SD Pre pandemic CTRL,288494.95727929054,cut-off AUC Spike IgG,,,,Mean HBD + 3SD Pre pandemic CTRL,58870.8596149185,cut-off AUC Spike IgM,,,,Mean HBD + 3SD Pre pandemic CTRL,1334157.8209121593,cut-off AUC Spike IgA,,,,Mean HBD + 3SD Pre pandemic CTRL,1614.283038030966,cut-off AUC Spike IgE,,
